{"text_format":"1","workbook":"xlsx","n_sheets":10,"sheets":["Eingabe","Formular Titelseite","Formular LZ","Formular MSS","Formular Seite 4","Bewertung LZ1","Bewertung LZ2","Bewertung MK","Bewertung SSK","Daten"],"not_rendered":{"charts":0,"images":0,"macros":1,"external_links":0,"defined_names":4,"comments":2,"pivot_tables":0},"unopened":[],"bounds":{"document_bytes":16777216,"sheet_cells":100000,"rows_first":2000,"rows_last":500,"rows_between":2000,"halvings":0,"cell_chars":16384,"cell_head_chars":4096},"cells_cut":0,"cells_raw":0,"read":"whole","date_system":"1900"}

{"sheet":"Eingabe","index":0,"n_rows":7,"n_cols":2,"rows_kept":7,"cut":false,"hidden":false,"merged":[]}
["Eingabemaske für ALS Formular und Bewertungsraster"]
[]
[null,"Nr. gemäss LLD"]
["Leistungsziel 1","§"]
["Leistungsziel 2",7]
["Methodenkompetenz",3]
["Sozial-/Selbstkompetenz",4]

{"sheet":"Formular Titelseite","index":1,"n_rows":21,"n_cols":1,"rows_kept":21,"cut":false,"hidden":false,"merged":[[1,0,1,1],[4,0,4,1],[5,0,5,1]]}
[]
["FORMULAR ALS"]
["Bildungsbericht (BiVo, Art. 16, Abs. 3)"]
[]
["Arbeits- und Lernsituation Nr: 1"]
[]
[]
["Lernende/Lernender\nName/Vorname"]
["Geburtsdatum/Bürgerort"]
["Ausbildungsbetrieb\nName/Ort"]
["Amt/Abteilung"]
["Berufsbildnerin/Berufsbildner\nName/Vorname"]
["Termine\nBeobachtungsperiode (mind. 2 Monate)"]
["Beurteilungsgespräch"]
[]
["Es wurden die oben erwähnte Arbeits- und Lernsituation sowie die nachstehend aufgeführten Leistungsziele und Methoden-,"]
["Sozial- und Selbstkompetenzen vereinbart."]
[]
["Datum"]
["Unterschrift\nBerufsbildnerin/Berufsbildner"]
["Unterschrift\nLernende/Lernender"]

{"sheet":"Formular LZ","index":2,"n_rows":18,"n_cols":4,"rows_kept":18,"cut":false,"hidden":false,"merged":[[14,0,14,3],[16,2,17,2],[4,0,4,3],[1,0,1,3],[7,2,8,2],[5,0,5,3],[10,0,10,3],[13,0,13,3]]}
[]
["Fachkompetenz "]
["Leistungsziel 1",null,null,{"$f":"Eingabe!B4","v":"§"}]
[]
[{"$f":"LOOKUP(D3,Daten!A2:A29,Daten!B2:B29)","v":{"$error":"#N/A"}}]
[{"$f":"LOOKUP(D3,Daten!A2:A29,Daten!E2:E29)","v":{"$error":"#N/A"}}]
["Teilkriterien","Punkte pro \nTeilkriterium \n(maximal 3)","erreichte\nPunkte\n(maximal 6)","Begründung"]
[{"$f":"LOOKUP(D3,Daten!A2:A29,Daten!F2:F29)","v":{"$error":"#N/A"}}]
[{"$f":"LOOKUP(D3,Daten!A2:A29,Daten!G2:G29)","v":{"$error":"#N/A"}}]
[]
["Fachkompetenz "]
["Leistungsziel 2",null,null,{"$f":"Eingabe!B5","v":7}]
[]
[{"$f":"LOOKUP(D12,Daten!A2:A29,Daten!B2:B29)","v":"1.1.3.1 Auftrag des Lehrbetriebes aufzeigen (K2)"}]
[{"$f":"LOOKUP(D12,Daten!A2:A29,Daten!E2:E29)","v":"Ich zeige den Auftrag /die Aufgaben des Lehrbetriebes verständlich auf. Dabei berücksichtige ich die gesetzlichen Grundlagen und zeige Schnittstellen zu anderen Abteilungen oder Ämtern auf. "}]
["Teilkriterien","Punkte pro \nTeilkriterium \n(maximal 3)","erreichte\nPunkte\n(maximal 6)","Begründung"]
[{"$f":"LOOKUP(D12,Daten!A2:A29,Daten!F2:F29)","v":"Erklärt die Aufgaben des Lehrbetriebes korrekt."}]
[{"$f":"LOOKUP(D12,Daten!A2:A29,Daten!G2:G29)","v":"Zeigt die Schnittstellen des Lehrbetriebes verständlich auf."}]

{"sheet":"Formular MSS","index":3,"n_rows":18,"n_cols":4,"rows_kept":18,"cut":false,"hidden":false,"merged":[[14,0,14,3],[16,2,17,2],[1,0,1,3],[4,0,4,3],[5,0,5,3],[7,2,8,2],[10,0,10,3],[13,0,13,3]]}
[]
["Methodenkompetenz"]
[null,null,null,{"$f":"Eingabe!B6","v":3}]
[]
[{"$f":"LOOKUP(D3,Daten!A30:A33,Daten!B30:B33)","v":"2.3 Erfolgreiches Beraten und Verhandeln"}]
[{"$f":"LOOKUP(D3,Daten!A30:A33,Daten!E30:E33)","v":"Ich setze wirksame Methoden für Beratungen und Verhandlungen mit externen und internen Partnern ein. Ich \n• kläre Bedürfnisse und Standpunkte; \n• erkenne und verstehe verbale und nonverbale Botschaften der Gesprächspartnerinnen und Gesprächspartner; \n• erarbeite angemessene Lösungsvorschläge; \n• erziele für die Beteiligten gute und erfolgreiche Ergebnisse. \n"}]
["Teilkriterien","Punkte pro \nTeilkriterium \n(maximal 3)","erreichte\nPunkte\n(maximal 6)","Begründung"]
[{"$f":"LOOKUP(D3,Daten!A30:A33,Daten!F30:F33)","v":"Versteht und deutet verbale und nonverbale Botschaften richtig."}]
[{"$f":"LOOKUP(D3,Daten!A30:A33,Daten!G30:G33)","v":"Erarbeitet Lösungsvorschläge, die vom Gesprächspartner akzeptiert werden können."}]
[]
["Sozial- und Selbstkompetenz"]
[null,null,null,{"$f":"Eingabe!B7","v":4}]
[]
[{"$f":"LOOKUP(D12,Daten!A34:A39,Daten!B34:B39)","v":"3.4 Umgangsformen"}]
[{"$f":"LOOKUP(D12,Daten!A34:A39,Daten!E34:E39)","v":"Ich lege im persönlichen Verhalten Wert auf gute Umgangsformen. Ich \n• bin pünktlich und zuverlässig, halte Ordnung und handle gewissenhaft; \n• passe meine Erscheinung den Gepflogenheiten der Unternehmung oder Organisation an und trete situationsgerecht auf; \n• halte in der mündlichen und schriftlichen Kommunikation sowie im Verhalten die Höflichkeitsregeln ein; \n• begegne den Menschen mit Anstand und Respekt. "}]
["Teilkriterien","Punkte pro \nTeilkriterium \n(maximal 3)","erreichte\nPunkte\n(maximal 6)","Begründung"]
[{"$f":"LOOKUP(D12,Daten!A34:A39,Daten!F34:F39)","v":"Ist pünktlich, arbeitet zuverlässig und hält Ordnung am Arbeitsplatz."}]
[{"$f":"LOOKUP(D12,Daten!A34:A39,Daten!G34:G39)","v":"Erscheint gepflegt, in entsprechender Kleidung (Betriebsvorgaben beachten) und begegnet Kunden/Anspruchsgruppen respektvoll."}]

{"sheet":"Formular Seite 4","index":4,"n_rows":24,"n_cols":12,"rows_kept":24,"cut":false,"hidden":false,"merged":[[5,8,5,11],[5,4,5,7],[5,0,5,3],[12,4,12,11],[11,4,11,11],[10,4,10,11],[12,0,12,3],[10,0,10,3],[11,0,11,3],[1,0,1,11],[2,0,2,11],[4,0,4,3],[4,4,4,7],[4,8,4,11]]}
[]
["Bewertung (maximal 24 Punkte"]
[]
[]
[" Total erreichete Punkte:",null,null,null," Note:",null,null,null," Diese Beurteilung und Bewertung\n wurde besprochen am:"]
[]
[]
[]
[]
[]
["Unterschrift\nBerufsbildernin/Berufsbildner"]
["Unterschrift\nLernende/Lernender"]
["Unterschrift\ngesetzliche Vertreterin/\ngesetzlicher Vertreter"]
[]
[]
[]
[]
[]
[]
[]
["Notenskala"]
[]
["Punkte","22-24","20-21","18-19","16-17","14-15","11-13","9-10","6-8","4-5","2-3","0-1"]
["Note",6,5.5,5,4.5,4,3.5,3,2.5,2,1.5,1]

{"sheet":"Bewertung LZ1","index":5,"n_rows":11,"n_cols":3,"rows_kept":11,"cut":false,"hidden":false,"merged":[[2,1,5,1],[7,1,10,1],[4,0,10,0]]}
["Beurteilung ALS: Leistungsziel 1"]
[]
[{"$f":"Eingabe!B4","v":"§"},{"$f":"LOOKUP(A3,Daten!A2:A29,Daten!F2:F29)","v":{"$error":"#N/A"}},"3\nErwartungen übertroffen"]
[{"$f":"LOOKUP(A3,Daten!A2:A29,Daten!B2:B29)","v":{"$error":"#N/A"}},null,"2\nerfüllt"]
[{"$f":"LOOKUP(A3,Daten!A2:A29,Daten!E2:E29)","v":{"$error":"#N/A"}},null,"1\nteilweise\nerfüllt"]
[null,null,"0\nnicht erfüllt"]
[]
[null,{"$f":"LOOKUP(A3,Daten!A2:A29,Daten!G2:G29)","v":{"$error":"#N/A"}},"3\nErwartungen übertroffen"]
[null,null,"2\nerfüllt"]
[null,null,"1\nteilweise\nerfüllt"]
[null,null,"0\nnicht erfüllt"]

{"sheet":"Bewertung LZ2","index":6,"n_rows":11,"n_cols":3,"rows_kept":11,"cut":false,"hidden":false,"merged":[[2,1,5,1],[4,0,10,0],[7,1,10,1]]}
["Beurteilung ALS: Leistungsziel 2"]
[]
[{"$f":"Eingabe!B5","v":7},{"$f":"LOOKUP(A3,Daten!A2:A29,Daten!F2:F29)","v":"Erklärt die Aufgaben des Lehrbetriebes korrekt."},"3\nErwartungen übertroffen"]
[{"$f":"LOOKUP(A3,Daten!A2:A29,Daten!B2:B29)","v":"1.1.3.1 Auftrag des Lehrbetriebes aufzeigen (K2)"},null,"2\nerfüllt"]
[{"$f":"LOOKUP(A3,Daten!A2:A29,Daten!E2:E29)","v":"Ich zeige den Auftrag /die Aufgaben des Lehrbetriebes verständlich auf. Dabei berücksichtige ich die gesetzlichen Grundlagen und zeige Schnittstellen zu anderen Abteilungen oder Ämtern auf. "},null,"1\nteilweise\nerfüllt"]
[null,null,"0\nnicht erfüllt"]
[]
[null,{"$f":"LOOKUP(A3,Daten!A2:A29,Daten!G2:G29)","v":"Zeigt die Schnittstellen des Lehrbetriebes verständlich auf."},"3\nErwartungen übertroffen"]
[null,null,"2\nerfüllt"]
[null,null,"1\nteilweise\nerfüllt"]
[null,null,"0\nnicht erfüllt"]

{"sheet":"Bewertung MK","index":7,"n_rows":11,"n_cols":3,"rows_kept":11,"cut":false,"hidden":false,"merged":[[2,1,5,1],[4,0,10,0],[7,1,10,1]]}
["Beurteilung ALS: Methodenkompetenz"]
[]
[{"$f":"Eingabe!B6","v":3},{"$f":"LOOKUP(A3,Daten!A30:A33,Daten!F30:F33)","v":"Versteht und deutet verbale und nonverbale Botschaften richtig."},"3\nErwartungen übertroffen"]
[{"$f":"LOOKUP(A3,Daten!A30:A33,Daten!B30:B33)","v":"2.3 Erfolgreiches Beraten und Verhandeln"},null,"2\nerfüllt"]
[{"$f":"LOOKUP(A3,Daten!A30:A33,Daten!E30:E33)","v":"Ich setze wirksame Methoden für Beratungen und Verhandlungen mit externen und internen Partnern ein. Ich \n• kläre Bedürfnisse und Standpunkte; \n• erkenne und verstehe verbale und nonverbale Botschaften der Gesprächspartnerinnen und Gesprächspartner; \n• erarbeite angemessene Lösungsvorschläge; \n• erziele für die Beteiligten gute und erfolgreiche Ergebnisse. \n"},null,"1\nteilweise\nerfüllt"]
[null,null,"0\nnicht erfüllt"]
[]
[null,{"$f":"LOOKUP(A3,Daten!A30:A33,Daten!G30:G33)","v":"Erarbeitet Lösungsvorschläge, die vom Gesprächspartner akzeptiert werden können."},"3\nErwartungen übertroffen"]
[null,null,"2\nerfüllt"]
[null,null,"1\nteilweise\nerfüllt"]
[null,null,"0\nnicht erfüllt"]

{"sheet":"Bewertung SSK","index":8,"n_rows":11,"n_cols":3,"rows_kept":11,"cut":false,"hidden":false,"merged":[[2,1,5,1],[4,0,10,0],[7,1,10,1]]}
["Beurteilung ALS: Sozial- und Selbstkompetenz"]
[]
[{"$f":"Eingabe!B7","v":4},{"$f":"LOOKUP(A3,Daten!A34:A39,Daten!F34:F39)","v":"Ist pünktlich, arbeitet zuverlässig und hält Ordnung am Arbeitsplatz."},"3\nErwartungen übertroffen"]
[{"$f":"LOOKUP(A3,Daten!A34:A39,Daten!B34:B39)","v":"3.4 Umgangsformen"},null,"2\nerfüllt"]
[{"$f":"LOOKUP(A3,Daten!A34:A39,Daten!E34:E39)","v":"Ich lege im persönlichen Verhalten Wert auf gute Umgangsformen. Ich \n• bin pünktlich und zuverlässig, halte Ordnung und handle gewissenhaft; \n• passe meine Erscheinung den Gepflogenheiten der Unternehmung oder Organisation an und trete situationsgerecht auf; \n• halte in der mündlichen und schriftlichen Kommunikation sowie im Verhalten die Höflichkeitsregeln ein; \n• begegne den Menschen mit Anstand und Respekt. "},null,"1\nteilweise\nerfüllt"]
[null,null,"0\nnicht erfüllt"]
[]
[null,{"$f":"LOOKUP(A3,Daten!A34:A39,Daten!G34:G39)","v":"Erscheint gepflegt, in entsprechender Kleidung (Betriebsvorgaben beachten) und begegnet Kunden/Anspruchsgruppen respektvoll."},"3\nErwartungen übertroffen"]
[null,null,"2\nerfüllt"]
[null,null,"1\nteilweise\nerfüllt"]
[null,null,"0\nnicht erfüllt"]

{"sheet":"Daten","index":9,"n_rows":39,"n_cols":7,"rows_kept":39,"cut":false,"hidden":false,"merged":[]}
[null,null,"Nr.","Titel","Text","TK1","TK2"]
[1,"1.1.1.1 Material/Waren beschaffen ohne Submission (K5)","1.1.1.1","Material/Waren beschaffen ohne Submission (K5)","Ich beschaffe Material und Waren gemäss betrieblichen und rechtlichen Vorgaben. Dabei erledige ich die folgenden Arbeiten fachgerecht:\n• Bedürfnisse abklären\n• Offerten einholen und vergleichen\n• Konditionen und Liefertermine abklären\n• Material/Waren bestellen\n• Lieferungen kontrollieren\n• Fehllieferungen beanstanden/korrigieren\n• Lieferantenrechnungen kontrollieren/kontieren","Vergleicht die eingeholten Offerten anhand der betriebsüblichen Kriterien.","Kontrolliert den Wareneingang und beanstandet (falls notwendig) Fehllieferungen selbstständig."]
[2,"1.1.1.2 Material/Waren lagern (K5)","1.1.1.2","Material/Waren lagern (K5)","Ich lagere Material und Waren fachgerecht ein. Dabei bewältige ich die folgenden Anforderungen kompetent:\n• Lieferungen einlagern\n• Lagerbestände nachführen\n• Lager bewirtschaften\n• Inventar erstellen\nDabei beachte ich die Vorgaben der Arbeits- und Betriebssicherheit sowie des\nGesundheitsschutzes.","Lagert das Material fachgerecht (mit Bezug auf das Produkt und die betrieblichen Gegebenheiten) ein.","Führt die Bestände und / oder Inventarlisten zuverlässig und richtig nach."]
[3,"1.1.2.1 Kenntnisse über die Produkte und Dienstleistungen einsetzen (K5)","1.1.2.1","Kenntnisse über die Produkte und Dienstleistungen einsetzen (K5)\n","Ich erkläre mit aussagekräftigen Unterlagen oder Mustern die Merkmale, Besonderheiten und Stärken der Produkte und Dienstleistungen meines Lehrbetriebes.\nIch setze diese Kenntnisse in der Arbeit mit verschiedenen Anspruchsgruppen, in den Arbeitsprozessen und bei den administrativen Aufgaben gezielt und überzeugend ein.","Stellt Unterlagen und Muster selbstständig, auf die Anspruchsgruppe ausgerichtet zusammen.","Überzeugt mit den Unterlagen und den entsprechenden Aussagen die Anspruchsgruppen."]
[4,"1.1.2.2 Interne und externe Kunden /Anspruchsgruppen angemessen bedienen (K5)","1.1.2.2","Interne und externe Kunden /Anspruchsgruppen angemessen bedienen (K5)","Ich erkenne meine Gesprächspartner in ihrer Rolle. Ich verhalte mich entsprechend und handle adressaten- und situationsgerecht.\nBeispiele:\n• Mitarbeitende anderer Verwaltungen oder Verwaltungsabteilungen\n• Die Behördenmitglieder\n• Die Bürger als verschiedene Kundentypen:\n• der Steuerzahler (der Kunde ist zu einer Leistung verpflichtet, erwartet aber eine klare Hilfestellung in der Erfüllung seiner Pflicht)\n• der Hilfeempfänger (der Kunde erhält finanzielle Unterstützung vom Staat, von dem er in hohem Masse abhängig ist. Der Staat ist Monopolist. Beispiel: Empfänger von Arbeitslosenunterstützung)\n• der Regulierte (der Kunde ist Betroffener von Inspektionen und Regulierungen. Er hat rechtliche Verpflichtungen, erwartet aber korrekte und rasche Aktivitäten des Staates. Beispiele: Sicherheitsbereich, Umweltschutzbereich)\n• der Käufer/Konsument (der Kunde kauft eine Leistung und bezahlt dafür eine Gebühr. Der Staat ist oft monopolistischer Anbieter. Beispiel: öffentlicher Verkehr.)","Charakterisiert die Anspruchsgruppen in verschiedenen Arbeitssituationen.","Handelt in den jeweiligen Situationen adressatengerecht unter Berücksichtigung der gesetzlichen Grundlagen und der Verwaltungsgrundsätze."]
[5,"1.1.2.3 Beratungs- und/oder Verkaufsgespräche führen und abschliessen (K5)","1.1.2.3","Beratungs- und/oder Verkaufsgespräche führen und abschliessen (K5)","Ich führe Kunden- und Beratungsgespräche freundlich, überzeugend und zielorientiert. Dabei setze ich meine Produkt- und Dienstleistungskenntnisse gezielt ein und gehe in den folgenden Schritten vor:\n• Kundengespräch vorbereiten\n• Kundengespräch führen (Handlungsspielraum und gesetzliche Rahmenbedingungen aufzeigen)\n• Verwaltungsakt vorbereiten und/oder vollziehen.","Bereitet selbstständig die wesentlichen Punkte für das Gespräch wie z.B. Bedürfnis, Zielsetzung, Handlungsspielraum, etc. vor.","Führt das Gespräch so, dass klar ist, welche konkreten\nSchritte folgen resp. wie die Zielsetzung erreicht wird."]
[6,"1.1.2.4 Kundenreklamationen bearbeiten (im Sinne von negativen Feedbacks) (K5)","1.1.2.4","Kundenreklamationen bearbeiten (im Sinne von negativen Feedbacks) (K5)","Ich nehme die Reklamation von Kunden und Anspruchsgruppen freundlich und angemessen auf. Ich zeige das weitere Vorgehen auf. ","Erkennt die Problemstellung.","Sucht mögliche Lösungswege unter Berücksichtigung des Handlungsspielraumes (betriebliche und gesetzliche Vorgaben)."]
[7,"1.1.3.1 Auftrag des Lehrbetriebes aufzeigen (K2)","1.1.3.1","Auftrag des Lehrbetriebes aufzeigen (K2)","Ich zeige den Auftrag /die Aufgaben des Lehrbetriebes verständlich auf. Dabei berücksichtige ich die gesetzlichen Grundlagen und zeige Schnittstellen zu anderen Abteilungen oder Ämtern auf. ","Erklärt die Aufgaben des Lehrbetriebes korrekt.","Zeigt die Schnittstellen des Lehrbetriebes verständlich auf."]
[8,"1.1.3.2 Kundenanfragen unter Berücksichtigung der Verwaltungsgrundsätze bearbeiten (K3)","1.1.3.2","Kundenanfragen unter Berücksichtigung der Verwaltungsgrundsätze bearbeiten (K3)","Ich bearbeite die Kundenanfragen gemäss den betrieblichen und rechtlichen Vorgaben fachgerecht. Ich erledige die folgenden Arbeiten kundengerecht und freundlich:\n• Persönliche und/oder schriftliche Kundenanfragen entgegennehmen\n• Kundenanfragen bearbeiten und beantworten oder an zuständige Personen weiterleiten\n• Kundenkontakte mit den entsprechenden Unterlagen nachvollziehbar dokumentieren\nDabei halte ich mich an die folgenden Verwaltungsgrundsätze:\n• Gesetzmässigkeit (Legalitätsprinzip)\n• Gleichheit\n• Treu und Glauben\n• Notwendigkeit und Verhältnismässigkeit","Erfasst die Kundenbedürfnisse vollständig und bearbeitet diese richtig.","Leitet die Anfragen mit nachvollziehbaren Informationen an die richtige Stelle/Person weiter."]
[9,"1.1.3.3 Rechtliche Grundlagen aufzeigen (K3)","1.1.3.3","Rechtliche Grundlagen aufzeigen (K3)","Ich zeige meinen Kunden/Gesprächspartnern die dem Dienstleistungsprozess zugrunde liegenden rechtlichen Rahmenbedingungen auf. Ich beschaffe mir die nötigen Rechtsgrundlagen und benütze dafür die geeigneten Mittel wie beispielsweise Internet/Intranet, Rechtssammlung.","Findet die rechtlichen Grundlagen innerhalb nützlicher Frist.","Stützt sich auf die richtigen gesetzlichen Grundlagen und wendet diese richtig an."]
[10,"1.1.3.4 Vollzugsarbeiten ausführen (K3)","1.1.3.4","Vollzugsarbeiten ausführen (K3)","Ich erbringe die Dienstleistungen für Kunden und Anspruchsgruppen fachgerecht und selbstständig unter Einhaltung und Anwendung der gesetzlichen Grundlagen, der Fristen, des Amtsgeheimnisses und des Datenschutzes. Dabei verwende und erläutere ich Fachausdrücke korrekt. ","Führt die erhaltenen Aufgaben und Dienstleistungen zuverlässig aus.","Berücksichtigt die Vorgaben und nutzt den Handlungsspielraum bei der Erbringung der Dienstleistung."]
[11,"1.1.3.5 Gebührenordnung anwenden (K3) ","1.1.3.5","Gebührenordnung anwenden (K3) ","Ich setze bei gebührenpflichtigen Dienstleistungen die Gebührenordnung korrekt ein.","Wendet die Gebührenordnung korrekt an.","Erklärt die Inhalte der Gebührenordnung richtig."]
[12,"1.1.3.6 Register führen (K3)","1.1.3.6","Register führen (K3)","Ich führe die (amtlichen) Register in meinem Arbeitsbereich selbstständig und fachgerecht (Datenschutz, Amtsgeheimnis, Aufbewahrung, Entsorgung) und nehme Mutationen vor. ","Erklärt den Nutzen des Registers korrekt.","Nimmt Mutationen selbstständig, fachgerecht und richtig vor."]
[13,"1.1.3.7 Bei Publikationen mitwirken (K3)","1.1.3.7","Bei Publikationen mitwirken (K3)","Ich übernehme bei Publikationen in meinem Arbeitsbereich die mir übertragenen Arbeiten. ","Setzt die erhaltenen Aufgaben gemäss Vorgaben richtig um.","Überprüft die eigene Arbeit (Selbstkontrolle)."]
[14,"1.1.3.8 Kenntnisse über den politischen Einfluss auf die Verwaltung (K2)","1.1.3.8","Kenntnisse über den politischen Einfluss auf die Verwaltung (K2)","Ich charakterisiere anhand von selbst gewählten Beispielen den Einfluss der Politik auf meine Verwaltungsebene und deren Aufgabenerledigung. ","Nennt mindestens 1 konkretes Beispiel.","Identifiziert die wichtigsten Faktoren, welche auf die Verwaltungsebene und deren Aufgabenerledigung wirken."]
[15,"1.1.4.1 Massnahmen der Öffentlichkeitsarbeit aufzeigen (K3)","1.1.4.1","Massnahmen der Öffentlichkeitsarbeit aufzeigen (K3)","Ich zeige aus meinem Arbeitsbereich die Massnahmen der Öffentlichkeitsarbeit für die einzelnen Zielgruppen auf. Ich setze adressatengerecht die zur Verfügung stehenden Mittel aus den Massnahmen der Öffentlichkeitsarbeit ein. Ich begreife mein persönliches Auftreten als Teil davon und setze dies authentisch um. ","Setzt die Mittel der Öffentlichkeitsarbeit gezielt und adressatengerecht ein.","Tritt authentisch auf."]
[16,"1.1.5.1 Personaleintritte und -austritte bearbeiten (K3)","1.1.5.1","Personaleintritte und -austritte bearbeiten (K3)","Ich bearbeite nach betrieblichen und rechtlichen Vorgaben die folgenden Aufgaben:\n• Mitwirkung bei Stellenausschreibungen\n• Vorbereitung von Verfügungen und Entscheiden\n• Erstellen von Dokumenten für die Sozialversicherungen ","Setzt die erhaltenen Aufgaben gemäss Vorgaben richtig um.","Überprüft die eigene Arbeit auf fachliche Richtigkeit\n(Selbstkontrolle)."]
[17,"1.1.5.2 Daten der Personaladministration bearbeiten (K3)","1.1.5.2","Daten der Personaladministration bearbeiten (K3)","Ich führe Arbeitszeiten, Absenzen und Personaldaten genau nach. Ich administriere Sozial- und Lohnnebenleistungen sowie Spesen.","Führt die Arbeiten genau aus.","Korrigiert Fehlerfassungen richtig und informiert\ngemäss betrieblichen Vorgaben."]
[18,"1.1.6.1 Ein- und ausgehende Rechnungen bearbeiten (K4)","1.1.6.1","Ein- und ausgehende Rechnungen bearbeiten (K4)","Ich erledige im Bereich des Rechnungswesens die folgenden Arbeiten und setze die entsprechenden Dokumente und elektronischen Hilfsmittel nach Vorgaben ein:\n• Debitorenrechnungen erstellen und verarbeiten\n• Kreditorenrechnungen verarbeiten\n• Rechnungs- und Buchungsfehler korrigieren\n• Mahnungen bearbeiten\n• Betreibungsabläufe erklären","Erstellt Debitorenrechnungen korrekt.","Kontiert und verarbeitet die Kreditorenrechnungen gemäss internen Vorgaben."]
[19,"1.1.6.2 Bei Abschlussarbeiten/ Voranschlägen mitarbeiten (K3)","1.1.6.2","Bei Abschlussarbeiten/ Voranschlägen mitarbeiten (K3)","Ich übernehme bei der Erstellung von Quartals- und/oder Jahresabschlüssen/Voranschlägen die folgenden Arbeiten gemäss Vorgaben:\n• Zahlenmaterial und Statistiken aufbereiten\n• Für den Abschluss: Nebenbücher führen und vorbereiten","Setzt die erhaltenen Aufgaben gemäss Vorgaben richtig um.","Überprüft die eigene Arbeit auf fachliche Richtigkeit (Selbstkontrolle)."]
[20,"1.1.6.3 Aufwendungen und Erträge erklären (K2) ","1.1.6.3","Aufwendungen und Erträge erklären (K2) ","Ich erkläre Inhalt und Bedeutung der wichtigsten Aufwendungen und Erträge aus meinem Aufgabenbereich verständlich. ","Erklärt die Bedeutung richtig.","Erklärt Inhalte korrekt."]
[21,"1.1.6.4 Einfache Geschäftsfälle kontieren und verbuchen (K3)","1.1.6.4","Einfache Geschäftsfälle kontieren und verbuchen (K3)","Ich kontiere und / oder verbuche einfache Geschäftsfälle selbstständig.","Kontiert die Belege richtig.","Verbucht richtig."]
[22,"1.1.7.1 Korrespondenz bearbeiten (K5)","1.1.7.1","Korrespondenz bearbeiten (K5)","Ich bearbeite selbstständig oder nach Vorgaben/Vorlagen folgende Korrespondenz korrekt und leite sie an die Adressaten weiter:\n• E-Mails\n• Briefe\n• Kurzbriefe\n• Fax\nDabei beachte ich die betrieblichen Richtlinien. ","Bearbeitet vollständig und fehlerfrei.","Berücksichtigt die betrieblichen Richtlinien."]
[23,"1.1.7.2 Dokumente erstellen (K3)","1.1.7.2","Dokumente erstellen (K3)","Ich verfasse selbstständig oder nach Vorgaben/Vorlagen adressatengerechte Dokumente. Dabei setze ich die geeigneten Instrumente ein.","Bearbeitet vollständig und fehlerfrei.","Berücksichtigt die betrieblichen Richtlinien."]
[24,"1.1.7.3 Dokumentationen gestalten (K3)","1.1.7.3","Dokumentationen gestalten (K3)","Ich gestalte mit geeigneten Instrumenten fachgerechte, überzeugende Dokumentationen.","Wählt die richtigen Instrumente resp. Programme aus.","Gestaltet die Dokumente fachgerecht."]
[25,"1.1.7.4 Daten und Dokumente verwalten (K3)","1.1.7.4","Daten und Dokumente verwalten (K3)","Ich verwalte Daten und Dokumente selbstständig. Ich setze die in meinem Arbeitsbereich eingesetzten Geräte ökologisch sinnvoll ein. Ich halte mich an die Vorgaben:\n• der Datensicherung\n• des Ordnungs- und Ablagesystems\n• des Archivierungssystems sowie an die betrieblichen und rechtlichen Vorgaben. ","Erläutert die betrieblichen Vorschriften betreffend Datensicherheit.","Arbeitet korrekt in den vorgegebenen Ordnungs- und Ablagestrukturen."]
[26,"1.1.7.5 Sitzungen und Anlässe vor- und nachbereiten (K3)","1.1.7.5","Sitzungen und Anlässe vor- und nachbereiten (K3)","Ich bereite Sitzungen und Anlässe fachgerecht vor und nach und beachte dabei die betrieblichen Richtlinien und Vorgaben. ","Berücksichtigt bei der Planung und den Vorbereitungsarbeiten die Vorgaben.","Die Umsetzung / Durchführung erfolgt gemäss dem erteilten Auftrag."]
[27,"1.1.7.6 Verwaltungsstruktur und Zuständigkeiten aufzeigen (K2)","1.1.7.6","Verwaltungsstruktur und Zuständigkeiten aufzeigen (K2)","Ich zeige die Verwaltungsstruktur und die Zuständigkeiten in meinem Arbeitsbereich korrekt auf. ","Erklärt die Verwaltungstruktur korrekt.","Zeigt die Zuständigkeiten verständlich auf."]
[28,"1.1.7.7 Brief- und Paketpost bearbeiten (K3)","1.1.7.7","Brief- und Paketpost bearbeiten (K3)","Ich bearbeite den Posteingang und Postausgang und erledige dabei zuverlässig die folgenden Arbeiten für die Brief- und Paketpost:\n• Entgegennahme\n• Sortierung\n• Verteilung\n• Verpackung\n• Frankierung","Verteilt die Post speditiv und richtig.","Bearbeitet die ein- und ausgehende Post gemäss den betrieblichen Vorgaben."]
[1,"2.1 Effizientes und systematisches Arbeiten",2.1,"Effizientes und systematisches Arbeiten","Ich führe meine Arbeiten effizient und systematisch aus. Ich \n• wähle Informationsquellen aufgabenbezogen aus und beschaffe mir zielgerichtet die erforderlichen Informationen; \n• plane meine Arbeiten und Projekte, setze Prioritäten und entscheide situationsgerecht; \n• führe meine Arbeiten kostenbewusst und zielorientiert aus; \n• kontrolliere und dokumentiere meine ausgeführten Arbeiten; \n• reflektiere meine Arbeiten und mein Handeln, um meine Leistungen und mein Verhalten zu optimieren. \nDazu setze ich passende Methoden und Hilfsmittel ein. \n","Systematisches, geplantes Vorgehen erkennbar.","Selbstkontrolle zur Zufriedenheit erfolgt."]
{"$rows_left_out":9}